• msged isnt compileable

    From Torsten Bamberg@2:240/5832 to Alle on Tuesday, November 01, 2016 23:03:03
    Hello all,

    actually the includes msged isn't compileable in the husky-environment.
    I'm using gcc /emx


    =##= Anfang "compile.log" =##=
    gcc -O3 -fomit-frame-pointer -fstrength-reduce -Wall -Zcrtdll -DOS2 -DUSE_MSGAPI -I.. -c addr.c
    ar r msgedemx.a addr.o
    gcc -O3 -fomit-frame-pointer -fstrength-reduce -Wall -Zcrtdll -DOS2 -DUSE_MSGAPI -I.. -c areas.c
    ar r msgedemx.a areas.o
    gcc -O3 -fomit-frame-pointer -fstrength-reduce -Wall -Zcrtdll -DOS2 -DUSE_MSGAPI -I.. -c bmg.c
    ar r msgedemx.a bmg.o
    gcc -O3 -fomit-frame-pointer -fstrength-reduce -Wall -Zcrtdll -DOS2 -DUSE_MSGAPI -I.. -c charset.c
    In file included from charset.c:19:
    msged.h:173: error: parse error before numeric constant
    msged.h:173: warning: no semicolon at end of struct or union
    msged.h:175: warning: type defaults to `int' in declaration of `ALIAS' msged.h:175: warning: data definition has no type or storage class
    msged.h:209: error: parse error before numeric constant
    msged.h:209: warning: no semicolon at end of struct or union
    msged.h:214: error: parse error before ':' token
    msged.h:215: error: parse error before ':' token
    msged.h:216: error: parse error before ':' token
    msged.h:217: error: parse error before ':' token
    msged.h:218: error: parse error before ':' token
    msged.h:219: error: parse error before ':' token
    msged.h:220: error: parse error before ':' token
    msged.h:221: error: parse error before ':' token
    msged.h:222: error: parse error before ':' token
    msged.h:223: error: parse error before ':' token
    msged.h:224: error: parse error before ':' token
    msged.h:225: error: parse error before ':' token
    msged.h:226: error: parse error before ':' token
    msged.h:227: error: parse error before ':' token
    msged.h:244: error: parse error before '}' token
    msged.h:245: warning: type defaults to `int' in declaration of `AREA' msged.h:245: warning: data definition has no type or storage class
    msged.h:284: error: parse error before numeric constant
    msged.h:284: warning: no semicolon at end of struct or union
    msged.h:287: error: parse error before '}' token
    msged.h:288: warning: type defaults to `int' in declaration of `msg' msged.h:288: warning: data definition has no type or storage class
    msged.h:304: error: parse error before "msg"
    msged.h:304: warning: no semicolon at end of struct or union
    msged.h:306: error: parse error before '*' token
    msged.h:309: error: parse error before '*' token
    msged.h:310: error: parse error before '*' token
    msged.h:317: error: parse error before '}' token
    msged.h:317: warning: type defaults to `int' in declaration of `msghandle' msged.h:317: warning: data definition has no type or storage class
    msged.h:451: error: parse error before "msgdo"
    msged.h:451: warning: type defaults to `int' in declaration of `msgdo' msged.h:451: warning: data definition has no type or storage class
    msged.h:452: error: parse error before numeric constant
    msged.h:456: error: parse error before '*' token
    msged.h:456: warning: type defaults to `int' in declaration of `arealist' msged.h:456: warning: data definition has no type or storage class
    msged.h:457: error: parse error before '*' token
    msged.h:457: warning: type defaults to `int' in declaration of `aliaslist' msged.h:457: warning: data definition has no type or storage class
    msged.h:462: error: parse error before '*' token
    msged.h:462: warning: type defaults to `int' in declaration of `message' msged.h:462: warning: data definition has no type or storage class
    msged.h:504: error: parse error before '*' token
    msged.h:504: error: parse error before '*' token
    msged.h:504: warning: type defaults to `int' in declaration of `KillMsg' msged.h:504: warning: data definition has no type or storage class
    msged.h:511: error: parse error before '*' token
    msged.h:451: warning: array `msgdo' assumed to have one element
    make: *** [charset.o] Error 1
    =##= Ende "compile.log" =##=


    Any hints?

    Bye/2 Torsten

    ... MAILBOX02: Up 11d 16h 54m (BTUp2V1.5)
    --- GoldED/2 1.1.5
    * Origin: DatenBahn BBS Hamburg (2:240/5832)